id,createdAt,updatedAt,concessionTypeName,discountPercentage,discountedAmount,isMonetaryDiscount,name,netPrice,quantity,taxAmount,taxName,unitPrice,archivedAt,code,deletedAt,totalIncludingTax,billableItemId,invoiceId,productId,account,objectId,ownerId
112748068,2020-07-17T07:54:03Z,2020-09-09T05:54:27Z,,,0.0,false,Theatre Fee,80.0,1,,,80.0,,F413,,80.0,435490,98307832,,42805,112748068,api@novansa.com.au
113480745,2020-07-27T02:36:14Z,2020-09-09T06:20:26Z,,,0.0,false,DVA Subsequent Consultation,66.3,1,,,66.3,,F012,,66.3,436024,98947770,,42805,113480745,api@novansa.com.au
114450900,2020-08-06T02:40:44Z,2020-09-09T06:11:26Z,,,0.0,false,DVA Subsequent Consultation,66.3,1,,,66.3,,F012,,66.3,436024,99795884,,42805,114450900,api@novansa.com.au
114468140,2020-08-06T04:55:33Z,2020-09-09T06:09:53Z,,,0.0,false,DVA Subsequent Consultation,66.3,1,,,66.3,,F012,,66.3,436024,99810647,,42805,114468140,api@novansa.com.au
114706935,2020-08-10T01:52:09Z,2020-09-09T06:08:00Z,,,0.0,false,DVA Subsequent Consultation,66.3,1,,,66.3,,F012,,66.3,436024,100018903,,42805,114706935,api@novansa.com.au
115185518,2020-08-14T07:05:00Z,2020-09-09T05:23:39Z,,,0.0,false,DVA Subsequent Consultation,66.3,1,,,66.3,,F012,,66.3,436024,100436928,,42805,115185518,api@novansa.com.au
115238896,2020-08-15T03:46:10Z,2020-09-09T05:26:57Z,,,0.0,false,DVA Subsequent Consultation,66.3,1,,,66.3,,F012,,66.3,436024,100483543,,42805,115238896,api@novansa.com.au
115303137,2020-08-17T03:59:04Z,2020-09-09T06:18:56Z,,,0.0,false,DVA Subsequent Consultation,66.3,1,,,66.3,,F012,,66.3,436024,100538901,,42805,115303137,api@novansa.com.au
115413904,2020-08-18T03:45:01Z,2020-09-09T06:37:03Z,,,0.0,false,DVA Subsequent Consultation,66.3,1,,,66.3,,F012,,66.3,436024,100636142,,42805,115413904,api@novansa.com.au
115544747,2020-08-19T06:07:08Z,2020-09-09T06:39:24Z,,,0.0,false,DVA Subsequent Consultation,66.3,1,,,66.3,,F012,,66.3,436024,100749530,,42805,115544747,api@novansa.com.au
115890468,2020-08-24T03:03:20Z,2020-09-09T06:23:13Z,,,0.0,false,DVA Subsequent Consultation,66.3,1,,,66.3,,F012,,66.3,436024,101050270,,42805,115890468,api@novansa.com.au
115894851,2020-08-24T03:45:12Z,2020-09-09T06:43:04Z,,,0.0,false,DVA Subsequent Consultation,66.3,1,,,66.3,,F012,,66.3,436024,101054084,,42805,115894851,api@novansa.com.au
115897669,2020-08-24T04:10:03Z,2020-09-09T06:26:01Z,,,0.0,false,DVA Initial Consultation,66.3,1,,,66.3,,F004,,66.3,436027,101056524,,42805,115897669,api@novansa.com.au
116111430,2020-08-26T02:36:09Z,2020-09-09T06:39:59Z,,,0.0,false,DVA Subsequent Consultation,66.3,1,,,66.3,,F012,,66.3,436024,101243660,,42805,116111430,api@novansa.com.au
116232031,2020-08-27T03:52:26Z,2020-09-09T06:13:05Z,,,0.0,false,DVA Subsequent Consultation,66.3,1,,,66.3,,F012,,66.3,436024,101347865,,42805,116232031,api@novansa.com.au
116417986,2020-08-29T01:26:46Z,2020-09-09T06:27:05Z,,,0.0,false,DVA Subsequent Consultation,66.3,1,,,66.3,,F012,,66.3,436024,101506924,,42805,116417986,api@novansa.com.au
116568725,2020-09-01T00:03:40Z,2020-09-01T00:03:40Z,,,0.0,false,Subsequent Consultation,80.0,1,,,80.0,,F012,,80.0,435651,101641982,,42805,116568725,api@novansa.com.au
116573523,2020-09-01T00:38:44Z,2020-09-01T00:38:44Z,,,0.0,false,Fox Fungal Nail Laser,179.0,1,,,179.0,,F014 Fox,,179.0,435654,101646245,,42805,116573523,api@novansa.com.au
116578368,2020-09-01T01:11:17Z,2020-09-01T01:11:17Z,,,0.0,false,Subsequent consultation (EPC),80.0,1,,,80.0,,10962,,80.0,435794,101650453,,42805,116578368,api@novansa.com.au
116582527,2020-09-01T01:39:15Z,2020-09-01T01:39:15Z,,,0.0,false,Custom Moulded Rigid Orthosis,260.0,1,,,260.0,,F221 Right,,260.0,435667,101654058,,42805,116582527,api@novansa.com.au
116582528,2020-09-01T01:39:15Z,2020-09-01T01:39:15Z,,,0.0,false,Custom Moulded Rigid Orthosis,260.0,1,,,260.0,,F221 Left,,260.0,435666,101654058,,42805,116582528,api@novansa.com.au
116585505,2020-09-01T01:59:09Z,2020-09-01T01:59:09Z,,,0.0,false,Subsequent Consultation,80.0,1,,,80.0,,F012,,80.0,435651,101656615,,42805,116585505,api@novansa.com.au
116589154,2020-09-01T02:24:06Z,2020-09-01T02:24:06Z,,,0.0,false,Custom Moulded Rigid Orthosis,260.0,1,,,260.0,,F221 Right,,260.0,435667,101659764,,42805,116589154,api@novansa.com.au
116589155,2020-09-01T02:24:06Z,2020-09-01T02:24:06Z,,,0.0,false,Custom Moulded Rigid Orthosis,260.0,1,,,260.0,,F221 Left,,260.0,435666,101659764,,42805,116589155,api@novansa.com.au
116589156,2020-09-01T02:24:06Z,2020-09-01T02:24:06Z,,,0.0,false,Short Consultation,50.0,1,,,50.0,,F010,,50.0,435649,101659764,,42805,116589156,api@novansa.com.au
116589533,2020-09-01T02:27:02Z,2020-09-01T02:27:02Z,Pension/HCC,,0.0,false,Subsequent Consultation,75.0,1,,,75.0,,F012,,75.0,435651,101660093,,42805,116589533,api@novansa.com.au
116596644,2020-09-01T03:22:21Z,2020-09-01T03:22:21Z,,,0.0,false,Subsequent Consultation,80.0,1,,,80.0,,F012,,80.0,435651,101666218,,42805,116596644,api@novansa.com.au
116597473,2020-09-01T03:29:11Z,2020-09-01T03:30:43Z,,,0.0,false,Short Consultation,50.0,1,,,50.0,,F010,,50.0,435649,101666926,,42805,116597473,api@novansa.com.au
116598732,2020-09-01T03:39:44Z,2020-09-01T03:39:44Z,Special pension rate,,0.0,false,Subsequent Consultation,65.0,1,,,65.0,,F012,,65.0,435651,101668011,,42805,116598732,api@novansa.com.au
116600663,2020-09-01T03:55:54Z,2020-09-01T03:55:54Z,,,0.0,false,Subsequent Consultation,80.0,1,,,80.0,,F012,,80.0,435651,101669672,,42805,116600663,api@novansa.com.au
116607684,2020-09-01T04:44:59Z,2020-09-01T04:44:59Z,,,0.0,false,Initial Consultation (Standard),135.0,1,,,135.0,,F004,,135.0,435645,101675754,,42805,116607684,api@novansa.com.au
116611602,2020-09-01T05:11:19Z,2020-09-01T05:11:19Z,,,0.0,false,Excision Of Nail/nail Matrix,140.0,1,,,140.0,,F474,,140.0,435500,101679155,,42805,116611602,api@novansa.com.au
116611603,2020-09-01T05:11:19Z,2020-09-01T05:11:19Z,,,0.0,false,Theatre Fee,50.0,1,,,50.0,,F413,,50.0,435490,101679155,,42805,116611603,api@novansa.com.au
116611604,2020-09-01T05:11:19Z,2020-09-01T05:11:19Z,,,0.0,false,Nail surgery dressing pack,10.0,1,,,10.0,,C034,,10.0,,101679155,1351250,42805,116611604,api@novansa.com.au
116617973,2020-09-01T05:55:23Z,2020-09-01T05:55:23Z,,,0.0,false,Subsequent Consultation,80.0,1,,,80.0,,F012,,80.0,435651,101684673,,42805,116617973,api@novansa.com.au
116619733,2020-09-01T06:05:52Z,2020-09-01T06:05:52Z,,,0.0,false,Subsequent Consultation,80.0,1,,,80.0,,F012,,80.0,435651,101686228,,42805,116619733,api@novansa.com.au
116620042,2020-09-01T06:07:51Z,2020-09-01T06:07:51Z,,,0.0,false,Extended Consult,125.0,1,,,125.0,,F014,,125.0,435655,101686492,,42805,116620042,api@novansa.com.au
116628178,2020-09-01T06:59:43Z,2020-09-01T06:59:43Z,,,0.0,false,Subsequent Consultation,80.0,1,,,80.0,,F012,,80.0,435651,101693596,,42805,116628178,api@novansa.com.au
116628283,2020-09-01T07:00:21Z,2020-09-01T07:00:21Z,,,0.0,false,Extended Consult,125.0,1,,,125.0,,F014,,125.0,435655,101693694,,42805,116628283,api@novansa.com.au
116628389,2020-09-01T07:01:00Z,2020-09-01T07:01:00Z,,,0.0,false,Initial consultation (EPC),110.0,1,,,110.0,,10962,,110.0,436223,101693795,,42805,116628389,api@novansa.com.au
116636329,2020-09-01T07:56:18Z,2020-09-01T07:56:18Z,,,0.0,false,Restorate 500mL,35.455,1,10.0,GST,35.455,,C060,,39.0,,101693795,1444113,42805,116636329,api@novansa.com.au
116639474,2020-09-01T08:20:21Z,2020-09-01T08:20:21Z,,,0.0,false,Initial Consultation (Standard),135.0,1,,,135.0,,F004,,135.0,435645,101703565,,42805,116639474,api@novansa.com.au
116639817,2020-09-01T08:23:24Z,2020-09-01T09:24:34Z,,,0.0,false,Excision Of Nail/nail Matrix,248.0,1,,,248.0,,F474,,248.0,435500,101703865,,42805,116639817,api@novansa.com.au
116639819,2020-09-01T08:23:24Z,2020-09-01T08:23:24Z,,,0.0,false,Theatre Fee,70.0,1,,,70.0,,F413,,70.0,435490,101703865,,42805,116639819,api@novansa.com.au
116639820,2020-09-01T08:23:24Z,2020-09-01T08:23:24Z,,,0.0,false,Nail surgery dressing pack,10.0,1,,,10.0,,C034,,10.0,,101703865,1351250,42805,116639820,api@novansa.com.au
116644419,2020-09-01T09:05:17Z,2020-09-01T09:05:17Z,,,0.0,false,Subsequent Consultation,80.0,1,,,80.0,,F012,,80.0,435651,101707863,,42805,116644419,api@novansa.com.au
116692799,2020-09-02T00:43:23Z,2020-09-02T00:43:23Z,,,0.0,false,Initial Consultation (Surgical),240.0,1,,,240.0,,F004 Surgical,,240.0,435647,101750439,,42805,116692799,api@novansa.com.au
116697978,2020-09-02T01:20:15Z,2020-09-02T01:40:10Z,,,0.0,false,Subsequent Consultation,80.0,1,,,80.0,,F012,,80.0,435651,101754991,,42805,116697978,api@novansa.com.au
116698641,2020-09-02T01:25:32Z,2020-09-02T01:25:32Z,,,0.0,false,Online Comprehensive Consultation Podiatric Surgeon,160.0,1,,,160.0,,F014,,160.0,921920,101755584,,42805,116698641,api@novansa.com.au
116700185,2020-09-02T01:35:29Z,2020-09-02T01:35:29Z,,,0.0,false,Subsequent consultation (EPC),80.0,1,,,80.0,,10962,,80.0,435794,101756911,,42805,116700185,api@novansa.com.au
116700669,2020-09-02T01:38:24Z,2020-09-02T01:38:24Z,,,0.0,false,Subsequent Consultation,80.0,1,,,80.0,,F012,,80.0,435651,101757330,,42805,116700669,api@novansa.com.au
116700789,2020-09-02T01:39:02Z,2020-09-02T01:39:02Z,,,0.0,false,Comprehensive Surgical Consultation,160.0,1,,,160.0,,F014 Surgical,,160.0,435656,101757438,,42805,116700789,api@novansa.com.au
116701417,2020-09-02T01:42:48Z,2020-09-02T01:42:48Z,,,0.0,false,Subsequent Consultation,80.0,1,,,80.0,,F012,,80.0,435651,101757971,,42805,116701417,api@novansa.com.au
116706275,2020-09-02T02:17:54Z,2020-09-02T02:34:25Z,,,0.0,false,Subsequent Consultation,80.0,1,,,80.0,,F012,,80.0,435651,101762187,,42805,116706275,api@novansa.com.au
116709501,2020-09-02T02:42:58Z,2020-09-02T02:42:58Z,,,0.0,false,Initial Consultation (Surgical),240.0,1,,,240.0,,F004 Surgical,,240.0,435647,101764915,,42805,116709501,api@novansa.com.au
116710526,2020-09-02T02:51:25Z,2020-09-02T02:51:25Z,,,0.0,false,AF7 ankle bracing sleeve,78.0,2,,,39.0,,C050,,78.0,,101764915,1351278,42805,116710526,api@novansa.com.au
116711614,2020-09-02T03:00:14Z,2020-09-02T03:00:14Z,,,0.0,false,Extended Consult,125.0,1,,,125.0,,F014,,125.0,435655,101766747,,42805,116711614,api@novansa.com.au
116712180,2020-09-02T03:04:17Z,2020-09-09T06:41:18Z,,,0.0,false,DVA Subsequent Consultation,66.3,1,,,66.3,,F012,,66.3,436024,101767227,,42805,116712180,api@novansa.com.au
116714716,2020-09-02T03:26:44Z,2020-09-02T03:26:44Z,,,0.0,false,Initial Consultation (Surgical),240.0,1,,,240.0,,F004 Surgical,,240.0,435647,101769348,,42805,116714716,api@novansa.com.au
116715312,2020-09-02T03:31:40Z,2020-09-02T03:31:40Z,,,0.0,false,Initial Consultation (Standard),135.0,1,,,135.0,,F004,,135.0,435645,101769847,,42805,116715312,api@novansa.com.au
116715729,2020-09-02T03:34:57Z,2020-09-02T03:34:57Z,,,0.0,false,Initial Consultation (Standard),135.0,1,,,135.0,,F004,,135.0,435645,101770220,,42805,116715729,api@novansa.com.au
116716960,2020-09-02T03:44:51Z,2020-09-02T03:44:51Z,Special pension rate,,0.0,false,Subsequent Consultation,65.0,1,,,65.0,,F012,,65.0,435651,101771235,,42805,116716960,api@novansa.com.au
116729103,2020-09-02T05:16:46Z,2020-09-02T05:16:46Z,,,0.0,false,Comprehensive Surgical Consultation,160.0,1,,,160.0,,F014 Surgical,,160.0,435656,101781603,,42805,116729103,api@novansa.com.au
116732958,2020-09-02T05:43:06Z,2020-09-02T05:43:06Z,,,0.0,false,Muscle Testing,80.0,1,,,80.0,,F111,,80.0,435659,101784908,,42805,116732958,api@novansa.com.au
116732959,2020-09-02T05:43:06Z,2020-09-02T05:43:06Z,,,0.0,false,ROM Study,80.0,1,,,80.0,,F114,,80.0,435660,101784908,,42805,116732959,api@novansa.com.au
116732960,2020-09-02T05:43:06Z,2020-09-02T05:43:06Z,,,0.0,false,Gait Analysis,80.0,1,,,80.0,,F117,,80.0,435663,101784908,,42805,116732960,api@novansa.com.au
116732961,2020-09-02T05:43:06Z,2020-09-02T05:43:06Z,,,0.0,false,Body Tech,80.0,1,,,80.0,,F014 BT,,80.0,435657,101784908,,42805,116732961,api@novansa.com.au
116737340,2020-09-02T06:11:13Z,2020-09-02T06:11:13Z,Special pension rate,,0.0,false,Subsequent Consultation,65.0,1,,,65.0,,F012,,65.0,435651,101788751,,42805,116737340,api@novansa.com.au
116737894,2020-09-02T06:14:51Z,2020-09-02T06:14:51Z,,,0.0,false,Extended Consult,125.0,1,,,125.0,,F014,,125.0,435655,101789216,,42805,116737894,api@novansa.com.au
116744175,2020-09-02T06:57:40Z,2020-09-02T06:57:40Z,,,0.0,false,Initial Consultation (Surgical),240.0,1,,,240.0,,F004 Surgical,,240.0,435647,101794759,,42805,116744175,api@novansa.com.au
116744400,2020-09-02T06:59:05Z,2020-09-02T06:59:05Z,,,0.0,false,Subsequent Consultation,80.0,1,,,80.0,,F012,,80.0,435651,101794974,,42805,116744400,api@novansa.com.au
116744680,2020-09-02T07:00:35Z,2020-09-02T07:00:35Z,,,0.0,false,Restorate foot balm,19.0,1,,,19.0,,C048,,19.0,,101795208,1351275,42805,116744680,api@novansa.com.au
116747470,2020-09-02T07:17:24Z,2020-09-02T07:17:24Z,,,0.0,false,Subsequent Consultation,80.0,1,,,80.0,,F012,,80.0,435651,101797579,,42805,116747470,api@novansa.com.au
116748274,2020-09-02T07:23:18Z,2020-09-02T07:23:18Z,,,0.0,false,Pedifix Toe Splint,18.0,1,,,18.0,,C070,,18.0,,101794759,1657398,42805,116748274,api@novansa.com.au
116751170,2020-09-02T07:43:01Z,2020-09-02T07:43:01Z,,,0.0,false,Subsequent Consultation,80.0,1,,,80.0,,F012,,80.0,435651,101800756,,42805,116751170,api@novansa.com.au
116752354,2020-09-02T07:52:04Z,2020-09-02T07:52:04Z,,,0.0,false,Initial Consultation (Surgical),195.0,1,,,195.0,,F004 Surgical,,195.0,435647,101801740,,42805,116752354,api@novansa.com.au
116752997,2020-09-02T07:56:51Z,2020-09-02T07:56:51Z,,,0.0,false,Subsequent consultation (EPC),80.0,1,,,80.0,,10962,,80.0,435794,101802321,,42805,116752997,api@novansa.com.au
116752998,2020-09-02T07:56:51Z,2020-09-02T07:56:51Z,,,0.0,false,Vasyli Pre Formed / Pre Moulded Orthotics,85.0,1,,,85.0,,F240,,85.0,,101802321,1373914,42805,116752998,api@novansa.com.au
116755918,2020-09-02T08:18:40Z,2020-09-02T08:18:40Z,,,0.0,false,Subsequent Consultation,80.0,1,,,80.0,,F012,,80.0,435651,101804953,,42805,116755918,api@novansa.com.au
116755919,2020-09-02T08:18:40Z,2020-09-02T08:18:40Z,,,0.0,false,FS6 compression foot sleeve,26.0,1,,,26.0,,C049,,26.0,,101804953,1351276,42805,116755919,api@novansa.com.au
116757178,2020-09-02T08:29:27Z,2020-09-02T08:29:27Z,,,0.0,false,Initial Consultation (Standard),135.0,1,,,135.0,,F004,,135.0,435645,101806017,,42805,116757178,api@novansa.com.au
116757198,2020-09-02T08:29:34Z,2020-09-02T08:29:34Z,,,0.0,false,Subsequent Consultation,80.0,1,,,80.0,,F012,,80.0,435651,101806035,,42805,116757198,api@novansa.com.au
116762964,2020-09-02T09:26:04Z,2020-09-02T09:26:04Z,,,0.0,false,Pre Formed / Pre Moulded Orthotics,85.0,1,,,85.0,,F240,,85.0,,101806017,1373916,42805,116762964,api@novansa.com.au
116806293,2020-09-03T00:17:13Z,2020-09-03T00:17:13Z,,,0.0,false,Subsequent consultation (EPC),80.0,1,,,80.0,,10962,,80.0,435794,101848687,,42805,116806293,api@novansa.com.au
116811875,2020-09-03T00:57:37Z,2020-09-03T00:57:37Z,,,0.0,false,Subsequent Consultation,80.0,1,,,80.0,,F012,,80.0,435651,101853594,,42805,116811875,api@novansa.com.au
116811953,2020-09-03T00:57:58Z,2020-09-09T06:14:27Z,,,0.0,false,DVA Subsequent Consultation,66.3,1,,,66.3,,F012,,66.3,436024,101853662,,42805,116811953,api@novansa.com.au
116814909,2020-09-03T01:17:09Z,2020-09-03T01:20:26Z,,,0.0,false,Initial consultation (EPC),110.0,1,,,110.0,,10962,,110.0,436223,101856272,,42805,116814909,api@novansa.com.au
116816638,2020-09-03T01:29:23Z,2020-09-03T01:29:23Z,,,0.0,false,Custom Moulded Rigid Orthosis,260.0,1,,,260.0,,F221 Right,,260.0,435667,101857785,,42805,116816638,api@novansa.com.au
116816639,2020-09-03T01:29:23Z,2020-09-03T01:29:23Z,,,0.0,false,Custom Moulded Rigid Orthosis,260.0,1,,,260.0,,F221 Left,,260.0,435666,101857785,,42805,116816639,api@novansa.com.au
116816640,2020-09-03T01:29:23Z,2020-09-03T01:29:23Z,,,0.0,false,Short Consultation,50.0,1,,,50.0,,F010,,50.0,435649,101857785,,42805,116816640,api@novansa.com.au
116820046,2020-09-03T01:53:43Z,2020-09-03T01:53:43Z,,,0.0,false,Heel raise,10.0,2,,,5.0,,O002,,10.0,,101860781,1351299,42805,116820046,api@novansa.com.au
116821489,2020-09-03T02:03:12Z,2020-09-03T02:03:12Z,,,0.0,false,Subsequent Consultation,80.0,1,,,80.0,,F012,,80.0,435651,101862052,,42805,116821489,api@novansa.com.au
116823055,2020-09-03T02:14:05Z,2020-09-03T02:14:05Z,Special pension rate,,0.0,false,Subsequent Consultation,65.0,1,,,65.0,,F012,,65.0,435651,101863446,,42805,116823055,api@novansa.com.au
116824272,2020-09-03T02:23:40Z,2020-09-03T02:23:40Z,Special pension rate,,0.0,false,Subsequent Consultation,65.0,1,,,65.0,,F012,,65.0,435651,101864481,,42805,116824272,api@novansa.com.au
116830578,2020-09-03T03:11:42Z,2020-09-03T03:11:42Z,,,0.0,false,Subsequent Consultation,80.0,1,,,80.0,,F012,,80.0,435651,101869966,,42805,116830578,api@novansa.com.au
116831290,2020-09-03T03:17:32Z,2020-09-03T03:17:32Z,,,0.0,false,Subsequent Consultation,80.0,1,,,80.0,,F012,,80.0,435651,101870563,,42805,116831290,api@novansa.com.au
116831305,2020-09-03T03:17:40Z,2020-09-03T03:17:40Z,Pension/HCC,,0.0,false,Subsequent Consultation,75.0,1,,,75.0,,F012,,75.0,435651,101870578,,42805,116831305,api@novansa.com.au
116831489,2020-09-03T03:19:05Z,2020-09-03T03:19:05Z,Special pension rate,,0.0,false,Subsequent Consultation,65.0,1,,,65.0,,F012,,65.0,435651,101870726,,42805,116831489,api@novansa.com.au
116834678,2020-09-03T03:45:59Z,2020-09-03T03:45:59Z,,,0.0,false,Archies arch support thongs U.S size 6,31.818,1,10.0,GST,31.818,,T002,,35.0,,101870726,1351338,42805,116834678,api@novansa.com.au
116834973,2020-09-03T03:48:38Z,2020-09-03T03:48:38Z,Special pension rate,,0.0,false,Subsequent Consultation,65.0,1,,,65.0,,F012,,65.0,435651,101873645,,42805,116834973,api@novansa.com.au
116837599,2020-09-03T04:08:23Z,2020-09-03T04:08:23Z,,,0.0,false,Subsequent Consultation,80.0,1,,,80.0,,F012,,80.0,435651,101875951,,42805,116837599,api@novansa.com.au
116839954,2020-09-03T04:25:59Z,2020-09-03T04:25:59Z,,,0.0,false,Subsequent Consultation,80.0,1,,,80.0,,F012,,80.0,435651,101877988,,42805,116839954,api@novansa.com.au
116842970,2020-09-03T04:45:25Z,2020-09-03T04:45:25Z,,,0.0,false,Archies arch support thongs U.S size 7,31.818,1,10.0,GST,31.818,,T003,,35.0,,101880576,1351339,42805,116842970,api@novansa.com.au
116854461,2020-09-03T05:59:11Z,2020-09-03T05:59:11Z,,,0.0,false,Subsequent Consultation,80.0,1,,,80.0,,F012,,80.0,435651,101890438,,42805,116854461,api@novansa.com.au
116856091,2020-09-03T06:07:55Z,2020-09-03T06:07:55Z,,,0.0,false,Subsequent Consultation,80.0,1,,,80.0,,F012,,80.0,435651,101891848,,42805,116856091,api@novansa.com.au
116860909,2020-09-03T06:38:06Z,2020-09-03T06:38:06Z,,,0.0,false,Subsequent Consultation,80.0,1,,,80.0,,F012,,80.0,435651,101896076,,42805,116860909,api@novansa.com.au
116866417,2020-09-03T07:10:31Z,2020-09-03T07:10:31Z,,,0.0,false,Subsequent Consultation,80.0,1,,,80.0,,F012,,80.0,435651,101900826,,42805,116866417,api@novansa.com.au
116868262,2020-09-03T07:21:51Z,2020-09-03T07:21:51Z,,,0.0,false,Subsequent Consultation,80.0,1,,,80.0,,F012,,80.0,435651,101902432,,42805,116868262,api@novansa.com.au
116870755,2020-09-03T07:37:48Z,2020-09-03T07:37:48Z,,,0.0,false,Extended Consult,125.0,1,,,125.0,,F014,,125.0,435655,101904636,,42805,116870755,api@novansa.com.au
116872276,2020-09-03T07:49:33Z,2020-09-03T07:49:33Z,,,0.0,false,Extended Consult,125.0,1,,,125.0,,F014,,125.0,435655,101905989,,42805,116872276,api@novansa.com.au
116877714,2020-09-03T08:29:54Z,2020-09-03T08:29:54Z,,,0.0,false,Subsequent Consultation,80.0,1,,,80.0,,F012,,80.0,435651,101910760,,42805,116877714,api@novansa.com.au
116877775,2020-09-03T08:30:20Z,2020-09-03T08:30:20Z,,,0.0,false,Subsequent Consultation,80.0,1,,,80.0,,F012,,80.0,435651,101910813,,42805,116877775,api@novansa.com.au
116881426,2020-09-03T09:01:45Z,2020-09-03T09:01:45Z,,,0.0,false,Subsequent Consultation,80.0,1,,,80.0,,F012,,80.0,435651,101914028,,42805,116881426,api@novansa.com.au
116882061,2020-09-03T09:07:46Z,2020-09-03T09:07:46Z,,,0.0,false,Subsequent Consultation,80.0,1,,,80.0,,F012,,80.0,435651,101914603,,42805,116882061,api@novansa.com.au
116882922,2020-09-03T09:17:37Z,2020-09-03T09:17:37Z,,,0.0,false,Subsequent Consultation,80.0,1,,,80.0,,F012,,80.0,435651,101915373,,42805,116882922,api@novansa.com.au
116883362,2020-09-03T09:22:34Z,2020-09-03T09:22:34Z,,,0.0,false,Cutiplast 8cm x 5m,38.0,1,,,38.0,,C011,,38.0,,101914603,1351159,42805,116883362,api@novansa.com.au
116883954,2020-09-03T09:29:34Z,2020-09-03T09:29:34Z,,,0.0,false,Subsequent Consultation,80.0,1,,,80.0,,F012,,80.0,435651,101916293,,42805,116883954,api@novansa.com.au
116928185,2020-09-04T00:01:14Z,2020-09-04T00:01:14Z,,,0.0,false,Refurb Orthotic All Other Funds,90.0,1,,,90.0,,F231 Standard,,90.0,435670,101954739,,42805,116928185,api@novansa.com.au
116931680,2020-09-04T00:24:47Z,2020-09-04T00:24:47Z,,,0.0,false,Initial Consultation (Standard),135.0,1,,,135.0,,F004,,135.0,435645,101957840,,42805,116931680,api@novansa.com.au
116935042,2020-09-04T00:48:10Z,2020-09-04T00:48:10Z,,,0.0,false,Initial Consultation (Surgical),240.0,1,,,240.0,,F004 Surgical,,240.0,435647,101960794,,42805,116935042,api@novansa.com.au
116939352,2020-09-04T01:16:31Z,2020-09-04T01:16:31Z,,,0.0,false,Subsequent Consultation,80.0,1,,,80.0,,F012,,80.0,435651,101964572,,42805,116939352,api@novansa.com.au
116942090,2020-09-04T01:34:24Z,2020-09-04T01:34:24Z,,,0.0,false,Cutiplast 6cm x 5m,32.0,1,,,32.0,,C010,,32.0,,101966950,1351156,42805,116942090,api@novansa.com.au
116943779,2020-09-04T01:46:16Z,2020-09-04T01:46:16Z,,,0.0,false,Comprehensive Surgical Consultation,160.0,1,,,160.0,,F014 Surgical,,160.0,435656,101968377,,42805,116943779,api@novansa.com.au
116944116,2020-09-04T01:48:40Z,2020-09-04T01:48:40Z,,,0.0,false,Muscle Testing,80.0,1,,,80.0,,F111,,80.0,435659,101968671,,42805,116944116,api@novansa.com.au
116944117,2020-09-04T01:48:40Z,2020-09-04T01:48:40Z,,,0.0,false,ROM Study,80.0,1,,,80.0,,F114,,80.0,435660,101968671,,42805,116944117,api@novansa.com.au
116944118,2020-09-04T01:48:40Z,2020-09-04T01:48:40Z,,,0.0,false,Gait Analysis,80.0,1,,,80.0,,F117,,80.0,435663,101968671,,42805,116944118,api@novansa.com.au
116944119,2020-09-04T01:48:40Z,2020-09-04T01:48:40Z,,,0.0,false,Body Tech,80.0,1,,,80.0,,F014 BT,,80.0,435657,101968671,,42805,116944119,api@novansa.com.au
116949221,2020-09-04T02:22:34Z,2020-09-04T02:22:34Z,,,0.0,false,Subsequent Consultation,80.0,1,,,80.0,,F012,,80.0,435651,101973191,,42805,116949221,api@novansa.com.au
116951803,2020-09-04T02:42:23Z,2020-09-04T02:42:23Z,,,0.0,false,Initial Consultation (Surgical),240.0,1,,,240.0,,F004 Surgical,,240.0,435647,101975460,,42805,116951803,api@novansa.com.au
116952588,2020-09-04T02:49:38Z,2020-09-04T02:49:38Z,Special pension rate,,0.0,false,Subsequent Consultation,65.0,1,,,65.0,,F012,,65.0,435651,101976157,,42805,116952588,api@novansa.com.au
116956523,2020-09-04T03:22:34Z,2020-09-04T03:22:34Z,,,0.0,false,Comprehensive Surgical Consultation,160.0,1,,,160.0,,F014 Surgical,,160.0,435656,101979550,,42805,116956523,api@novansa.com.au
116964504,2020-09-04T04:32:25Z,2020-09-04T04:32:25Z,,,0.0,false,Subsequent consultation (EPC),80.0,1,,,80.0,,10962,,80.0,435794,101986504,,42805,116964504,api@novansa.com.au
116965915,2020-09-04T04:43:54Z,2020-09-04T04:43:54Z,,,0.0,false,SolvEasy cream 30g,19.0,1,,,19.0,,C042,,19.0,,101986504,1351264,42805,116965915,api@novansa.com.au
116967188,2020-09-04T04:54:54Z,2020-09-04T04:54:54Z,,,0.0,false,Ball of foot gel cushions,9.9,1,,,9.9,,C027,,9.9,,101988865,1351193,42805,116967188,api@novansa.com.au
116968943,2020-09-04T05:07:09Z,2020-09-04T05:07:09Z,,,0.0,false,Custom Moulded Rigid Orthosis,75.0,1,,,75.0,,F221 Right,,75.0,435667,101990389,,42805,116968943,api@novansa.com.au
116968944,2020-09-04T05:07:09Z,2020-09-04T05:07:09Z,,,0.0,false,Custom Moulded Rigid Orthosis,76.0,1,,,76.0,,F221 Left,,76.0,435666,101990389,,42805,116968944,api@novansa.com.au
116969186,2020-09-04T05:08:58Z,2020-09-04T05:08:58Z,Pension/HCC,,0.0,false,Initial Consultation (Standard),135.0,1,,,135.0,,F004,,135.0,435645,101990607,,42805,116969186,api@novansa.com.au